�S���n�������c�̃R�[�h,�@�l�ԍ�,ID,�n�������c�̖�,�C�x���g��,����R�[�h,�C�x���g�ʏ�,�T�u�^�C�g��,�C�x���g��_�J�i,�C�x���g��_�p��,�R���e���cURL,���,�L�[���[�h,�^�O,�ΏۂƂȂ�Y��,�J�Ãp�^�[��,�J�n��,�I����,�J�n����,�I������,�J�n�������L����,���v����,�f�ڊJ�n��,�f�ڏI����,�T�v,����,�T�u�C�x���g,�C�x���g���,����(��{),����(�ڍ�),�A���於��,�A����d�b�ԍ�,�A��������ԍ�,��Î�,���Òc��,�֘A�g�D,�Ώێ�,�ΏێҔ��l,�ꏊ����,�W���i��t�j�ꏊ,���ݒn�Q�S���n�������c�̃R�[�h,����ID,���ݒn�Q�A���W�L,���ݒn�Q�s���{��,���ݒn�Q�s�撬��,���ݒn�Q����,���ݒn�Q�Ԓn�ȉ�,���������i�����j,�ܓx,�o�x,�A�N�Z�X���@,���ԏ���,���ԏꗿ��,���֏���,Web�J��,Web�J��URL,�c�[���E��,���,������l,�������,���ώ��,�O����Ή�,�O����Ή����l,�J�Ï���,�Q���\���I����,�Q���\���I������,�Q���\�����@,�\���J�n��,�\���J�n����,�\��URL,URL,������,���ނւ��R�[�i�[,���H��,�x�r�[�J�[�ݏo,�x�r�[�J�[���p,�摜,�摜�Q���C�Z���X,���l
232076,,TY1200000010,���m���L��s,�L��s���܂�,JA,�����ł��,,�g���J���V�~���}�c��,,,,,,,���N5���ɊJ��,5����4�y�j��,5����4���j��,,,,,2019-04-08,,,,,,,,,,,,,,,,�L��s�싅�����,,232076,,���m���L��s�z�K�꒚��79����,���m��,�L��s,�z�K�꒚��,79����,,34.828766,137.375992,,,,,,,,,,,,,,,,,,,,,,,,,,,,,
232076,,TY1200000020,���m���L��s,�L���׏t�G���,JA,�L�N�F���,,�g���J���C�i���V�����L�^�C�T�C,,,,,,,���N5���ɊJ��,5��4��,5��5��,,,,,2019-04-08,,,,,,,,,,,,,,,,�L����,,232076,,���m���L��s�L�쒬1�Ԓn,���m��,�L��s,�L�쒬,1�Ԓn,,34.825470,137.392456,,,,,,,,,,,,,,,,,,,,,,,,,,,,,
232076,,TY1200000030,���m���L��s,���O�͂ӂ邳�ƌ����@�ӂ邳�Ət�܂� ,JA,,,�q�K�V�~�J���t���T�g�R�E�G���@�t���T�g�n���}�c��,,,,,,,,4����{,5����{,,,,,2019-04-08,,,,,,,,,,,,,,,,���O�͂ӂ邳�ƌ���,,232076,,���m���L��s�������P��11-2,���m��,�L��s,�������P��,11��2,,34.846813,137.312775,,,,,,,,,,,,,,,,,,,,,,,,,,,,,
232076,,TY1200000040,���m���L��s,�Ԃ��傤�ԍ�,JA,,,�n�i�V���E�u�}�c��,,,,,,,�J�ԏ󋵂ɂ��J��,5�����{,6�����{,,,,,2019-04-08,,,,,,,,,,,,,,,,�ԒˎR����,,232076,,���m���L��s�s�c�������1�Ԓn30,���m��,�L��s,�s�c�������,1�Ԓn30,,34.848289,137.360672,,,,,,,,,,,,,,,,,,,,,,,,,,,,,
232076,,TY1200000050,���m���L��s,��Ð_�З���,JA,�����Ղ�,,�~�g�W���W�����C�^�C�T�C,,,,,,,���N4���ɊJ��,4����3�y�j��,4����3���j��,,,,,2019-04-08,,,,,,,,,,,,,,,,��Ð_��,,232076,,���m���L��s��Ò��L���P�c70,���m��,�L��s,��Ò��L���P�c,70,,34.822472,137.311325,,,,,,,,,,,,,,,,,,,,,,,,,,,,,
232076,,TY1200000060,���m���L��s,�����̔����{���� ,JA,,,�����^�m�n�`�}���O�E���C�^�C�T�C,,,,,,,���N4���ɊJ��,4����2�y�j��,4����2���j��,,,,,2019-04-08,,,,,,,,,,,,,,,,�����������{,,232076,,���m���L��s�������{��16,���m��,�L��s,�������{��,16,,34.837711,137.339935,,,,,,,,,,,,,,,,,,,,,,,,,,,,,
232076,,TY1200000070,���m���L��s,�Ԃ̝���� ,JA,,,,,,,,,,���N4���ɊJ��,4����1�y�j��,4����1���j��,,,,,2019-04-08,,,,,,,,,,,,,,,,�ד���א_��,,232076,,���m���L��s�ד����{�e32�Ԓn,���m��,�L��s,�ד����{�e,32�Ԓn,,34.818390,137.318649,,,,,,,,,,,,,,,,,,,,,,,,,,,,,
232076,,TY1200000080,���m���L��s,�L��E���̃~�c�o�c�c�W�܂� ,JA,,,�g���J���n�M�m�~�c�o�c�c�W�}�c��,,,,,,,�J�ԏ󋵂ɂ��J��,4����{,4�����{,,,,,2019-04-08,,,,,,,,,,,,,,,,�y�m�_�Ў���,,232076,,���m���L��s�����_�c10�Ԓn,���m��,�L��s,�����_�c,10�Ԓn,,34.877209,137.333344,,,,,,,,,,,,,,,,,,,,,,,,,,,,,
232076,,TY1200000090,���m���L��s,�L��s���܂� ,JA,,,�g���J���V�T�N���}�c��,,,,,,,�J�ԏ󋵂ɂ��J��,3�����{,4�����{,,,,,2019-04-08,,,,,,,,,,,,,,,,���g���l���ق�,,232076,,���m���L��s�z�K�꒚��117-3�ق�,���m��,�L��s,�z�K�꒚��,117-3�ق�,,34.827221,137.373886,,,,,,,,,,,,,,,,,,,,,,,,,,,,,
232076,,TY1200000100,���m���L��s,��t��,JA,���Ȃ�������,,���J�o�T�C,,,,,,,���N4���ɊJ��,4��7�E8���ɋ߂��y�j��,4��7�E8���ɋ߂����j��,,,,,2019-04-08,,,,,,,,,,,,,,,,���v�۔�����,,232076,,���m���L��s���v�ے����164,���m��,�L��s,���v�ے����,164,,34.812866,137.383545,,,,,,,,,,,,,,,,,,,,,,,,,,,,,
232076,,TY1200000110,���m���L��s,�u���_�З���,JA,,,�g�K�W���W�����C�^�C�T�C,,,,,,,���N5���ɊJ��,5��3��,5��5��,,,,,2019-04-08,,,,,,,,,,,,,,,,�u���_�З��{,,232076,,���m���L��s��{�����_��2,���m��,�L��s,��{�����_��,2,,34.847977,137.420807,,,,,,,,,,,,,,,,,,,,,,,,,,,,,
232076,,TY1200000120,���m���L��s,�ԍ��̎��q���_�y ,JA,,,�A�J�l�m�V�V�}�C�J�O��,,,,,,,���N4���ɊJ��,4����4�y�j��,4����4���j��,,,,,2019-04-08,,,,,,,,,,,,,,,,�����_��,,232076,,���m���L��s��Ò��ԍ����c1,���m��,�L��s,��Ò��ԍ����c,1,,34.847977,137.420807,,,,,,,,,,,,,,,,,,,,,,,,,,,,,
232076,,TY1200000130,���m���L��s,���܂� ,JA,,,�J�[�}�c��,,,,,,,���N4���ɊJ��,4����2�y�j��,4����2���j��,,,,,2019-04-08,,,,,,,,,,,,,,,,�p���_��,,232076,,���m���L��s����䒬�{�e2,���m��,�L��s,����䒬�{�e,2,,34.796959,137.365845,,,,,,,,,,,,,,,,,,,,,,,,,,,,,
232076,,TY1200000140,���m���L��s,�q�b����܂�,JA,,,�`�G�����W���}�c��,,,,,,,���N3���ɊJ��,3���ŏI���j��,3���ŏI���j��,,,,,2019-04-08,,,,,,,,,,,,,,,,���ꎛ,,232076,,���m���L��s���꒬�ω��R3,���m��,�L��s,���꒬�ω��R,3,,34.874729,137.356110,,,,,,,,,,,,,,,,,,,,,,,,,,,,,
232076,,TY1200000150,���m���L��s,�݂��܍Ղ� ,JA,,,�~�^�}�}�c��,,,,,,,���N8���ɊJ��,8��7��,8��8��,,,,,2019-04-08,,,,,,,,,,,,,,,,�L���ׁE�L��w�O,,232076,,���m���L��s�L�쒬1�Ԓn����,���m��,�L��s,�L�쒬,1�Ԓn����,,34.825470,137.392456,,,,,,,,,,,,,,,,,,,,,,,,,,,,,
232076,,TY1200000160,���m���L��s,���{�Ă܂� ,JA,,,�R�E�i�c�}�c��,,,,,,,���N7���ɊJ��,7���ŏI�y�j��,7���ŏI���j��,,,,,2019-04-08,,,,,,,,,,,,,,,,���{����А_��,,232076,,���m���L��s���{������5�Ԓn,���m��,�L��s,���{������,5�Ԓn,,34.838627,137.323547,,,,,,,,,,,,,,,,,,,,,,,,,,,,,
232076,,TY1200000170,���m���L��s,����Ă܂� ,JA,,,�S���i�c�}�c��,,,,,,,���N8���ɊJ��,8����1�y�j��,8����1���j��,,,,,2019-04-08,,,,,,,,,,,,,,,,����_�Ђق�,,232076,,���m���L��s������V�V�I31,���m��,�L��s,������V�V�I,31,,34.847359,137.309647,,,,,,,,,,,,,,,,,,,,,,,,,,,,,
232076,,TY1200000190,���m���L��s,�L��Ă܂� ,JA,,,�g���J���i�c�}�c��,,,,,,,���N7���ɊJ��,7��20���ɋ߂����j��,7��20���ɋ߂����j��,,,,,2019-04-08,,,,,,,,,,,,,,,,�L��i�Y�_��,,232076,,���m���L��s�L�쐼��134,���m��,�L��s,�L�쐼��,134,,34.825951,137.396362,,,,,,,,,,,,,,,,,,,,,,,,,,,,,
232076,,TY1200000200,���m���L��s,���x��E�����_�x�� ,JA,,,�T�T�I�h���E�V�`�t�N�W���I�h��,,,,,,,���N8���ɊJ��,8����1���j��,8����1���j��,,,,,2019-04-08,,,,,,,,,,,,,,,,���n�_�ЁE������,,232076,,���m���L��s��Ò���n�~�c3,���m��,�L��s,��Ò���n�~�c,3,,34.800766,137.317215,,,,,,,,,,,,,,,,,,,,,,,,,,,,,
232076,,TY1200000210,���m���L��s,�J��܂� ,JA,,,�A�}�S�C�}�c��,,,,,,,���N8���ɊJ��,8�����{,8�����{,,,,,2019-04-08,,,,,,,,,,,,,,,,�{���V�_��,,232076,,���m���L��s�ԍ⒬�{�H1120,���m��,�L��s,�ԍ⒬�{�H,1120,,34.853931,137.298218,,,,,,,,,,,,,,,,,,,,,,,,,,,,,
232076,,TY1200000220,���m���L��s,�ɒm���_�ЏH�t�΍Ղ� ,JA,,,,,,,,,,���N9���ɊJ��,9����2�y�j��,9����2�y�j��,,,,,2019-04-08,,,,,,,,,,,,,,,,�ɒm���_��,,232076,,���m���L��s�s�c���{�c9,���m��,�L��s,�s�c���{�c,9,,34.845840,137.353592,,,,,,,,,,,,,,,,,,,,,,,,,,,,,
232076,,TY1200000230,���m���L��s,�{�{�܂� ,JA,,,�z���O�E�}�c��,,,,,,,���N11���ɊJ��,11����{,11����{,,,,,2019-04-08,,,,,,,,,,,,,,,,�{�{�̓�����,,232076,,���m���L��s�㒷�R���{�{��1�Ԓn1685,���m��,�L��s,�㒷�R���{�{��,1�Ԓn1685,,34.878361,137.426880,,,,,,,,,,,,,,,,,,,,,,,,,,,,,
232076,,TY1200000240,���m���L��s,�݂Ƃӂꂠ���܂�,JA,,,�~�g�t���A�C�}�c��,,,,,,,���N10���ɊJ��,10�����{,10�����{,,,,,2019-04-08,,,,,,,,,,,,,,,,��Õ�����َ���,,232076,,���m���L��s��Ò��L�Γ���146����,���m��,�L��s,��Ò��L�Γ���,146����,,34.819870,137.314499,,,,,,,,,,,,,,,,,,,,,,,,,,,,,
232076,,TY1200000250,���m���L��s,�����������܂�,JA,,,�R�U�J�C�A�I�C�}�c��,,,,,,,���N10���ɊJ��,10�����{,10�����{,,,,,2019-04-08,,,,,,,,,,,,,,,,����䈨���َ���,,232076,,���m���L��s����䒬��x10����,���m��,�L��s,����䒬��x,10����,,34.801201,137.358704,,,,,,,,,,,,,,,,,,,,,,,,,,,,,
232076,,TY1200000260,���m���L��s,�ԍ�h�{�H���݂��܂� ,JA,,,�A�J�T�J�V���N�~���W���~�W�}�c��,,,,,,,���N11���ɊJ��,11�����{,11�����{,,,,,2019-04-08,,,,,,,,,,,,,,,,�勴��,,232076,,���m���L��s���H���g��127-1,���m��,�L��s,���H���g��,127��1,,34.855999,137.307648,,,,,,,,,,,,,,,,,,,,,,,,,,,,,
232076,,TY1200000270,���m���L��s,�L���׏H�G���,JA,������,,�g���J���C�i���V���E�L�^�C�T�C,,,,,,,���N11���ɊJ��,11����3�y�j��,11����3���j��,,,,,2019-04-08,,,,,,,,,,,,,,,,�L����,,232076,,���m���L��s�L�쒬1�Ԓn,���m��,�L��s,�L�쒬,1�Ԓn,,34.825470,137.392456,,,,,,,,,,,,,,,,,,,,,,,,,,,,,
232076,,TY1200000280,���m���L��s,�喼�s�� ,JA,,,�_�C�~���E�M���E���c,,,,,,,���N10���ɊJ��,10����2���j��,10����2���j��,,,,,2019-04-08,,,,,,,,,,,,,,,,���X������,,232076,,���m���L��s�ԍ⒬��㊎�15,���m��,�L��s,�ԍ⒬��㊎�,15,,34.859863,137.304688,,,,,,,,,,,,,,,,,,,,,,,,,,,,,
232076,,TY1200000290,���m���L��s,�c�Ղ�i�p���_�Ёj ,JA,,,�^�}�c��,,,,,,,,������7��,������7��,,,,,2019-04-08,,,,,,,,,,,,,,,,�p���_��,,232076,,���m���L��s����䒬�{�e2,���m��,�L��s,����䒬�{�e,2,,34.796959,137.365845,,,,,,,,,,,,,,,,,,,,,,,,,,,,,
232076,,TY1200000300,���m���L��s,�~�܂�,JA,,,�E���}�c��,,,,,,,�J�ԏ󋵂ɂ��J��,2����{,3����{,,,,,2019-04-08,,,,,,,,,,,,,,,,�ԒˎR����,,232076,,���m���L��s�s�c�������1�Ԓn30,���m��,�L��s,�s�c�������,1�Ԓn30,,34.848289,137.360672,,,,,,,,,,,,,,,,,,,,,,,,,,,,,
232076,,TY1200000310,���m���L��s,�ǂ�,JA,,,�h���L,,,,,,,���N12���ɊJ��,12����3���j��,12����3���j��,,,,,2019-04-08,,,,,,,,,,,,,,,,������,,232076,,���m���L��s��Ò������e�k�Y17-1,���m��,�L��s,��Ò������e�k�Y,17��1,,34.809196,137.325287,,,,,,,,,,,,,,,,,,,,,,,,,,,,,
232076,,TY1200000320,���m���L��s,�Ε���,JA,,,,,,,,,,���N2���ɊJ��,2��7��,2��7��,,,,,2019-04-08,,,,,,,,,,,,,,,,������_��,,232076,,���m���L��s��{����1,���m��,�L��s,��{����,1,,34.847977,137.420807,,,,,,,,,,,,,,,,,,,,,,,,,,,,,
232076,,TY1200000330,���m���L��s,�����,JA,,,,,,,,,,���N1���ɊJ��,1��15��,1��15��,,,,,2019-04-08,,,,,,,,,,,,,,,,�u���_�Љ��{,,232076,,���m���L��s�㒷�R���{�{��4,���m��,�L��s,�㒷�R���{�{��,4,,34.878361,137.426880,,,,,,,,,,,,,,,,,,,,,,,,,,,,,
232076,,TY1200000340,���m���L��s,�c�V��,JA,,,,,,,,,,���N1���ɊJ��,1��3��,1��3��,,,,,2019-04-08,,,,,,,,,,,,,,,,�u���_�З��{,,232076,,���m���L��s��{�����_��2,���m��,�L��s,��{�����_��,2,,34.847977,137.420807,,,,,,,,,,,,,,,,,,,,,,,,,,,,,
232076,,TY1200000350,���m���L��s,���c�A��,JA,,,�I�^�E�G�}�c��,,,,,,,���N1���ɊJ��,1��3��,1��3��,,,,,2019-04-08,,,,,,,,,,,,,,,,���ꎛ,,232076,,���m���L��s���꒬�ω��R3,���m��,�L��s,���꒬�ω��R,3,,34.874729,137.356110,,,,,,,,,,,,,,,,,,,,,,,,,,,,,
232076,,TY1200000360,���m���L��s,���{�̎s ,JA,,,�R�E�m�C�`,,,,,,,���N2���ɊJ��,2��11��,2��11��,,,,,2019-04-08,,,,,,,,,,,,,,,,���{���@�����C��,,232076,,���m���L��s���{������,���m��,�L��s,���{��,����,,34.837212,137.328934,,,,,,,,,,,,,,,,,,,,,,,,,,,,,
232076,,TY1200000370,���m���L��s,��a�̑傢���傤�E�ό����Y�W ,JA,,,���}�g�m�I�I�C�`���E�E�J���R�E�u�b�T���e��,,,,,,,���N12���ɊJ��,12����{,12����{,,,,,2019-04-08,,,,,,,,,,,,,,,,��a���т����L��,,232076,,���m���L��s�L�Ò����c53-1,���m��,�L��s,�L�Ò����c,53��1,,34.849262,137.429031,,,,,,,,,,,,,,,,,,,,,,,,,,,,,
232076,,TY1200000380,���m���L��s,�u���_�Ё@�ߕ��� ,JA,,,�g�K�W���W���Z�c�u���T�C,,,,,,,���N2���ɊJ��,2��3��,2��3��,,,,,2019-04-08,,,,,,,,,,,,,,,,�u���_�З��{,,232076,,���m���L��s��{�����_��2,���m��,�L��s,��{�����_��,2,,34.847977,137.420807,,,,,,,,,,,,,,,,,,,,,,,,,,,,,
232076,,TY1200000390,���m���L��s,�܎Ј�׎Ё@�ߕ��� ,JA,,,�S�V���C�i���V���Z�c�u���T�C,,,,,,,���N2���ɊJ��,2��3��,2��3��,,,,,2019-04-08,,,,,,,,,,,,,,,,�܎Ј�׎�,,232076,,���m���L��s����䒬���R2,���m��,�L��s,����䒬���R,2,,34.798737,137.368500,,,,,,,,,,,,,,,,,,,,,,,,,,,,,
